{"text_format":"1","workbook":"xlsx","n_sheets":16,"sheets":[" Page 1","Page 2","RR Indicators","Scale","CR Indicators","EI Indicators","RR-Results","RR-Graphs","CR-Results","CR-Graphs","EI-Results","Main Dashboard","EI-Graphs","OverAll Analysis","Sheet1","Answers for the results"],"not_rendered":{"charts":25,"images":4,"macros":1,"external_links":0,"defined_names":27,"comments":0,"pivot_tables":0},"unopened":[],"bounds":{"document_bytes":16777216,"sheet_cells":100000,"rows_first":2000,"rows_last":500,"rows_between":2000,"halvings":0,"cell_chars":16384,"cell_head_chars":4096},"cells_cut":0,"cells_raw":0,"read":"whole","date_system":"1900"}

{"sheet":" Page 1","index":0,"n_rows":15,"n_cols":1,"rows_kept":15,"cut":false,"hidden":false,"merged":[[14,0,14,2],[2,0,2,2],[9,0,9,2],[3,0,3,2],[12,0,12,2],[8,0,8,2],[10,0,10,2],[11,0,11,2]]}
[]
[]
[]
["Building Back Better (BBB) is a  holistic approach taken following a pandemic to improve the physical, social and economic conditions of affected communities during the during/post-pandemic recovery process in an effective and efficient way.  BBB is centred around the local community's best interests.  A recovery effort that aims to build back better consists of three focus areas: Risk Reduction, Community Recovery and Effective Implementation."]
[]
[]
[]
[]
{"$rows_left_out":8}
{"sheet":"Page 2","index":1,"n_rows":48,"n_cols":3,"rows_kept":48,"cut":false,"hidden":false,"merged":[[0,0,1,3],[20,0,21,0],[20,1,21,1],[20,2,21,2],[3,0,3,2],[4,0,4,2],[14,0,14,2],[15,0,15,2],[16,0,16,2],[18,0,18,2],[22,0,22,2],[28,0,28,2],[47,0,47,2],[46,0,46,2],[23,1,23,2],[24,1,24,2],[25,1,25,2],[26,1,26,2]]}
[]
[]
[]
["Features of BBB Tool"]
[]
[]
[]
[]
{"$rows_left_out":41}
{"sheet":"RR Indicators","index":2,"n_rows":28,"n_cols":13,"rows_kept":28,"cut":false,"hidden":false,"merged":[[22,0,25,0],[22,10,25,10],[22,11,25,11],[15,0,15,11],[16,0,20,0],[16,10,20,10],[16,11,20,11],[21,0,21,11],[0,0,0,11],[1,0,1,11],[3,0,14,0],[3,10,14,10],[3,11,14,11]]}
["BUILD BACK BETTER TOOL"]
["1.  Risk Reduction"]
["BBB Principle","Indicator code","Indicators",null,"0 (Not applicable)",1,2,3,4,"ANSWER","Your Rating","Max Rating","Max Rating"]
["1.1 Health Sector Resilience Strengthening the health sector to withstand emergency/ pandemic","HR1","Knowledge of the hazard (Understanding of thealth hazards affecting individual or community and resulting risks and vulnerabilities)",null,"Not applicable","Poor or outdated understanding of diseases and no accurate knowledge of risks and vulnerabilities","Very little knowledge of diseases affecting the community and resulting risks and vulnerabilities","Moderate knowledge of diseases affecting the community and its resulting risks and vulnerabilities","Accurate, up-to-date understanding of all the diseases affecting individuals or community and their resulting risks and vulnerabilities",null,{"$f":"SUM(J4:J15)","v":0},{"$f":"SUM(M4:M15)","v":0},{"$f":"IF(J4>0,4,0)","v":0}]
[null,"HR2","Health infrastructure (Hospitals equipped with good quality infrastructure and medical equpiment)",null,"Not applicable","Poor availability of medical equipment available and facilities at the hospital","Only limited good quality medical equipment is available. Facilities at the hopsital are mediocre. ","Medical equipment is mostly good quality. Majority of hospital facilities are available during emergency/pandemic situations","Hospitals equipped with good quality equipment related to the disease (e.g. ventilators, testing kits, etc.) and there are adequate facilities (beds, toilets, water, safe waste management, etc.) to accommodate high demands during emergency/pandemic situations ",null,null,null,{"$f":"IF(J5>0,4,0)","v":0}]
[null,"HR3","Medical supplies",null,"Not applicable","Insufficient medical supplies are available. Usually need to refer to neighbouring hospitals ","Limited medical supplies are available. Typically can't manage during emergencies. In case of shortage, need to rely on the neighbouring hospitals ","Moderate medical supplies are available and able to manage medical emergencies most of the time. In case of shortage, there is an adhoc plan to acquire the necessary medical supplies","Adequate medical supplies are available and emergencies are efficiently managed. In case of shortage, an effective plan is in place to acquire the necessary medical supplies from the health network",null,null,null,0]
[null,"HR4","Communication with stakeholders (Communicating with stakeholders and health networks to know the community's needs and demands and disseminate health information to the community)",null,"Not applicable","No or little communication with stakeholders to gather information on community's needs and demands and disseminate up to date health information to the community","Sporadic communication of the community's needs and demands and dissemination of up to date health information to the community","Moderate communication of the community's needs and demands and dissemination of up to date health information to the community","Regular and well-thought out communication with stakeholders and health network to gather community's needs and demands prior to developing strategy plans during emergencies. Regular and well-thought out disseminatino of up to date health information to the community based on the developed strategy and plans",null,null,null,0]
[null,"HR5","Extra funding (Plan for supporting future demand of resources like equipment, medication, staff etc.)",null,"Not applicable","No planning at all for extra funding","Little planning for extra funding with regards to medical supplies and staff for emergencies","Plans for long term funding for medical supplies and staff during uncertainties is available but there is no support provided by the government","Long-term funding mechanisms is in place to fund extra costs  incurred to purchase medical supplies and hire medical professionals and staff during emergencies",null,null,null,0]
{"$rows_left_out":21}
{"sheet":"Scale","index":3,"n_rows":11,"n_cols":2,"rows_kept":11,"cut":false,"hidden":true,"merged":[]}
["Definitely not, probably not, might or might not, probably yes, Definitely Yes"]
[]
["Not at all, small degree, moderate degree, high degree, very high degree","https://www.google.com/search?q=yes+no+likert+scale&rlz=1C1CHBF_enNZ770NZ770&source=lnms&tbm=isch&sa=X&ved=0ahUKEwjPg5a7sM7fAhWEabwKHZBdAisQ_AUIDigB&biw=767&bih=710&dpr=1.25#imgrc=CpUXrD4phRanBM:"]
[]
[]
["None at all, A little, A moderate amount, A lot, A great deal"]
["Not well at all, slightly well, moderately well, very well, extremely well"]
["Not knowledgable at all, slightly knowledgeable, moderately knowledgeable, very knowledgeable, extremely knowledgeable"]
{"$rows_left_out":4}
{"sheet":"CR Indicators","index":4,"n_rows":24,"n_cols":14,"rows_kept":24,"cut":false,"hidden":false,"merged":[[0,1,0,12],[1,1,1,12],[11,1,20,1],[11,11,20,11],[11,12,20,12],[3,1,9,1],[3,11,9,11],[3,12,9,12]]}
[null,"BUILD BACK BETTER TOOL"]
[null,"2. Community Recovery"]
[null,"BBB Principle","Indicator code","Indicators",null,"0 (Not applicable)",1,2,3,4,"ANSWER","Your Rating","Max Rating","Max Rating"]
[null,"2.1 Psychological and Social Recovery \nRestoring community wellbeing and strengthening the community’s ability to bounce back by supporting and empowering the community. ","PR1","Community Advisory Service (Advisory service to provide information on emergencies/pandemics and connect with affected households)",null,"Not applicable","No single, reliable source of information and support for the community to consult","Some ad-hoc information provided to the community but no service in place for the community to consult","Community advisory service is in place but difficult to reach","Community advisory services established to provide information and connect with affected households ",null,{"$f":"SUM(K4:K10)","v":0},{"$f":"SUM(N4:N10)","v":0},{"$f":"IF(K4>0,4,0)","v":0}]
[null,null,"PR2","Specialised assistance to vulnerable groups (providing specialised assistance to support them)",null,"Not applicable","No assistance at all","Little to no information on vulnerable groups in the community and no specialised assistance to support them","Vulnerable groups in the community are identified but no specialised assistance to support them","Vulnerable groups in the community identified and specialised assistance organised to support them",null,null,null,{"$f":"IF(K5>0,4,0)","v":0}]
[null,null,"PR3","Psychological support and counselling services (Providing psychological support and counselling services to the community)",null,"Not applicable","No counselling services available","Some psychological support and counselling services provided to the community","Psychological support and counselling services provided to the community most of the time","Psychological support and counselling services are well organised for the community",null,null,null,0]
[null,null,"PR4","Alternative activities to create community togetherness during emergency/pandemic situations (Organising activities and support groups to bring the community together)",null,"Not applicable","No consideration given to bring the community together and build community cohesion","Little consideration given to planning and implementing activities to bring the community together and build community cohesion","Support groups are formed and appropriate alternative activities (e.g. Online activities, events and groups) are planned but there is a lack of cohesion among the community due to poor execution","Appropriate alternative activities and support groups organised to bring the community together and build social cohesion during emergencies/pandemics. Sense of community and togetherness created",null,null,null,0]
[null,null,"PR5","Informing the Community (Informing the community regularly on recovery decisions and progress)",null,"Not applicable","No communication with the community at all","Irregular communication with the community to inform and update on recovery decisions and progress ","Communication with the community only when deemed necessary by authorities to inform and update on recovery decisions and progress  ","Community informed regularly on recovery decisions and progress using appropriate channels",null,null,null,0]
{"$rows_left_out":17}
{"sheet":"EI Indicators","index":5,"n_rows":25,"n_cols":14,"rows_kept":25,"cut":false,"hidden":false,"merged":[[0,1,0,12],[20,1,22,1],[20,11,22,11],[20,12,22,12],[3,1,13,1],[3,11,13,11],[3,12,13,12],[15,1,18,1],[15,11,18,11],[15,12,18,12],[19,1,19,12],[1,1,1,12]]}
[null,"BUILD BACK BETTER TOOL"]
[null,"3. Effective Implementation"]
[null,"BBB Principle","Indicator code","Indicators",null,"0 (Not applicable)",1,2,3,4,"ANSWER","Your Rating","Max Rating","Max Rating"]
[null,"3.1 Institutional Mechanism      Choosing an appropriate institutional mechanism to plan and implement recovery and long-term resilience building activities","IM1","Recovery Authority (Creating a local-level separate body to plan, implement and manage recovery activities)",null,"Not applicable","No Recovery Authority at all","Ad-hoc, reactive, uncoordinated recovery planning and implementation by individual organisations, or an external Recovery Authority created with little to no involvement of local government and local leaders","Coordinated recovery planning and implementation by individual organisations, or an external Recovery Authority created with some involvement of local government and local leaders","A local-level body most suited to the local context consisting of local government and local community representation chosen to plan, implement and manage recovery activities, and facilitate coordination and partnerships between stakeholders involved in recovery ",null,{"$f":"SUM(K4:K14)","v":0},{"$f":"SUM(N4:N14)","v":0},{"$f":"IF(K4>0,4,0)","v":0}]
[null,null,"IM2","Level of Centralisation/ Decentralisation (Selecting the level of centralisation and/or decentralisation most suited to the local context)",null,"Not applicable","Level of centralisation/decentralisation unclear or inappropriate for the local community context","Level of centralisation/decentralisation sometimes inappropriate for the local community context","Level of centralisation and/or decentralisation appropriate most of the time for local context","Level of centralisation and/or decentralisation most suited to the local context and community chosen to combine central-level coordination of recovery with decentralised planning and implementation",null,null,null,{"$f":"IF(K5>0,4,0)","v":0}]
[null,null,"IM3","Supporting impacted organisations (Strengthening the capacity of impacted organisations)",null,"Not applicable","No support provided to organisations impacted during pandemic","Little support provided to the organisations impacted by pandemic, who are key local stakeholders such as hospitals to take part in recovery","Moderate support provided to organisations impacted by pandemic","Significant support provided and capacity of impacted organisations  strengthened (eg: hospitals/clinics)  to be able to take part in recovery",null,null,null,0]
[null,null,"IM4","Defining Roles and Responsibilities for Stakeholders (Determining stakeholder’s roles and responsibilities to avoid ad-hoc and duplicated activities)",null,"Not applicable","No clear roles and responsibilities for health workers and health network stakeholders leading to ad-hoc and duplicated activities","Only a few roles and responsibilities are defined ","Most of the health workers, and stakeholder's roles and responsibilities are defined","Clear roles and responsibilities established for all health workers and stakeholders in the health network",null,null,null,0]
[null,null,"IM5","Recovery fund (Fund for emegency/pandemic recovery)",null,"Not applicable","No recovery funding mechanism in place","Ad-hoc funding arrangements with little control and accountability on funds received and spent for recovery ","Funding arrangements are in place with control most of the time and accountability on funds received and spent for recovery ","An exclusive, singular fund for recovery created to direct all funds dedicated to recovery into one pool for clear accountability and allocation for different recovery needs",null,null,null,0]
{"$rows_left_out":18}
{"sheet":"RR-Results","index":6,"n_rows":28,"n_cols":7,"rows_kept":28,"cut":false,"hidden":false,"merged":[[1,1,1,4],[1,5,1,6],[2,1,2,5],[4,1,26,1],[4,2,15,2],[16,2,16,6],[17,2,21,2],[22,2,22,6],[23,2,26,2]]}
[]
[null,"Results",null,null,null,{"$f":"'Page 2'!B25","v":0}]
[null,"Disaster Risk Reduction ",null,null,null,null,{"$f":"'Page 2'!B26","v":"00:00:00"}]
[null,"Dimension","Principle","Indicator code","Indicators","Your Rating","Do this to improve Resilience of your Community"]
[null,"Disaster Risk Reduction","Health Sector Resilience","HR1","Knowledge of the hazard",{"$f":"'RR Indicators'!$J4","v":0},{"$f":"IF(AND($F5>0,$F5<4),'Answers for the results'!$B3,IF('RR-Results'!$F5=0,'Answers for the results'!$D$6, 'Answers for the results'!$D$3))","v":"Not applicable"}]
[null,null,null,"HR2","Health infrastructure (Hospitals equipped with good quality infrastructure and medical equpiment)",{"$f":"'RR Indicators'!$J5","v":0},{"$f":"IF(AND($F6>0,$F6<4),'Answers for the results'!$B4,IF('RR-Results'!$F6=0,'Answers for the results'!$D$6, 'Answers for the results'!$D$3))","v":"Not applicable"}]
[null,null,null,"HR3","Medical supplies",{"$f":"'RR Indicators'!$J6","v":0},{"$f":"IF(AND($F7>0,$F7<4),'Answers for the results'!$B5,IF('RR-Results'!$F7=0,'Answers for the results'!$D$6, 'Answers for the results'!$D$3))","v":"Not applicable"}]
[null,null,null,"HR4","Communication with stakeholders ",{"$f":"'RR Indicators'!$J7","v":0},{"$f":"IF(AND($F8>0,$F8<4),'Answers for the results'!$B6,IF('RR-Results'!$F8=0,'Answers for the results'!$D$6, 'Answers for the results'!$D$3))","v":"Not applicable"}]
{"$rows_left_out":21}
{"sheet":"RR-Graphs","index":7,"n_rows":259,"n_cols":16,"rows_kept":259,"cut":false,"hidden":false,"merged":[[54,15,54,22],[8,1,8,2],[9,1,9,2],[7,1,7,21],[8,15,8,22],[9,15,9,22]]}
[]
[]
[]
[]
[]
[]
[]
[null,"Risk Reduction Graphs"]
{"$rows_left_out":252}
{"sheet":"CR-Results","index":8,"n_rows":24,"n_cols":7,"rows_kept":24,"cut":false,"hidden":false,"merged":[[1,1,1,6],[12,2,12,6],[5,1,22,1],[5,2,11,2],[13,2,22,2],[2,1,2,4],[2,5,2,6],[3,1,3,5]]}
[]
[]
[null,"Results",null,null,null,{"$f":"'Page 2'!B25","v":0}]
[null,"Community Recovery",null,null,null,null,{"$f":"'Page 2'!B26","v":"00:00:00"}]
[null,"Dimension","Principle","Indicator code","Indicators","Your Rating","Suggestions/comments"]
[null,"Community Recovery","Psychological and Social Recovery ","PR1","Community Advisory Service",{"$f":"'CR Indicators'!$K4","v":0},{"$f":"IF(AND($F6>0,$F6<4),'Answers for the results'!$B27,IF('CR-Results'!$F6=0,'Answers for the results'!$D$6, 'Answers for the results'!$D$3))","v":"Not applicable"}]
[null,null,null,"PR2","Specialised assistance to vulnerable group",{"$f":"'CR Indicators'!$K5","v":0},{"$f":"IF(AND($F7>0,$F7<4),'Answers for the results'!$B28,IF('CR-Results'!$F7=0,'Answers for the results'!$D$6, 'Answers for the results'!$D$3))","v":"Not applicable"}]
[null,null,null,"PR3","Psychological support and counselling services",{"$f":"'CR Indicators'!$K6","v":0},{"$f":"IF(AND($F8>0,$F8<4),'Answers for the results'!$B29,IF('CR-Results'!$F8=0,'Answers for the results'!$D$6, 'Answers for the results'!$D$3))","v":"Not applicable"}]
{"$rows_left_out":17}
{"sheet":"CR-Graphs","index":9,"n_rows":311,"n_cols":16,"rows_kept":311,"cut":false,"hidden":false,"merged":[[6,0,6,1],[7,0,7,1],[5,6,5,12],[46,12,46,19]]}
[]
[]
[]
[]
[]
[null,null,null,null,null,null,"Community Recovery Graphs"]
["Location",null,":",{"$f":"'Page 2'!B27","v":0},null,null,null,null,null,null,null,null,null,null,null,{"$f":"'Page 2'!B25","v":0}]
[null,null,null,null,null,null,null,null,null,null,null,null,null,null,null,{"$f":"'Page 2'!B26","v":"00:00:00"}]
{"$rows_left_out":304}
{"sheet":"EI-Results","index":10,"n_rows":26,"n_cols":7,"rows_kept":26,"cut":false,"hidden":false,"merged":[[22,2,24,2],[17,2,20,2],[5,2,15,2],[5,1,24,1],[1,1,1,6],[2,1,2,4],[2,5,2,6],[3,1,3,5],[21,2,21,6]]}
[]
[]
[null,"Results ",null,null,null,{"$f":"'Page 2'!B25","v":0}]
[null,"Effective Implementation",null,null,null,null,{"$f":"'Page 2'!B26","v":"00:00:00"}]
[null,"Dimension","Principle","Indicator code","Indicators","Your Rating","Suggestions/Comments"]
[null,"Effective Implementation","Institutional Mechanism ","IM1","Recovery Authority",{"$f":"'EI Indicators'!$K4","v":0},{"$f":"IF(AND($F6>0,$F6<4),'Answers for the results'!$B46,IF('EI-Results'!$F6=0,'Answers for the results'!$D$6, 'Answers for the results'!$D$3))","v":"Not applicable"}]
[null,null,null,"IM2","Level of Centralisation/ Decentralisation",{"$f":"'EI Indicators'!$K5","v":0},{"$f":"IF(AND($F7>0,$F7<4),'Answers for the results'!$B47,IF('EI-Results'!$F7=0,'Answers for the results'!$D$6, 'Answers for the results'!$D$3))","v":"Not applicable"}]
[null,null,null,"IM3","Supporting impacted organisations",{"$f":"'EI Indicators'!$K6","v":0},{"$f":"IF(AND($F8>0,$F8<4),'Answers for the results'!$B48,IF('EI-Results'!$F8=0,'Answers for the results'!$D$6, 'Answers for the results'!$D$3))","v":"Not applicable"}]
{"$rows_left_out":19}
{"sheet":"Main Dashboard","index":11,"n_rows":24,"n_cols":9,"rows_kept":24,"cut":false,"hidden":true,"merged":[[9,1,10,10],[11,1,13,5],[11,6,13,8],[0,1,8,11]]}
[]
[]
[]
[]
[]
[]
[]
[]
{"$rows_left_out":17}
{"sheet":"EI-Graphs","index":12,"n_rows":382,"n_cols":18,"rows_kept":382,"cut":false,"hidden":false,"merged":[[51,14,51,22],[6,7,7,14],[8,17,8,22],[9,17,9,22],[8,0,8,1],[9,0,9,1]]}
[]
[]
[]
[]
[]
[]
[null,null,null,null,null,null,null,"Effective Implementation Graphs"]
[]
{"$rows_left_out":375}
{"sheet":"OverAll Analysis","index":13,"n_rows":264,"n_cols":262,"rows_kept":264,"cut":false,"hidden":false,"merged":[[100,1,100,3],[10,2,10,3],[9,2,9,3],[1,1,7,15],[12,1,40,15],[41,1,62,15]]}
[]
[]
[]
[]
[]
[]
[]
[]
{"$rows_left_out":257}
{"sheet":"Sheet1","index":14,"n_rows":0,"n_cols":0,"rows_kept":0,"cut":false,"hidden":true,"merged":[]}

{"sheet":"Answers for the results","index":15,"n_rows":65,"n_cols":4,"rows_kept":65,"cut":false,"hidden":true,"merged":[]}
["Indicator Codes","High Resilience Indicators",null,"Used combination formula ( &\" \"&) "]
[null,"Answers for 1 to 3",null,"Answers for only 4"]
["SR1","Obtain accurate, up-to-date understanding of all the diseases affecting individuals or community and their resulting risks and vulnerabilities",null,"You are doing a great job!!"]
["SR2","Make sure hospitals are equipped with good quality equipment related to the disease (e.g. ventilators, testing kits, etc.) and there are adequate facilities (beds, toilets, water, safe waste management, etc.) to accommodate high demands during emergency/pandemic situations "]
["SR3","Make sure adequate medical supplies are available to manage emergencies efficiently. In case of shortage, be prepaded with an effective plan to acquire the necessary medical supplies from the health network",null,"Answers for only 0"]
["SR4","Communicate regularly  with stakeholders and health network to gather community's needs and demands prior to developing strategy plans during emergencies. Disseminate up to date health information to the community based on the developed strategy and plans",null,"Not applicable"]
["SR5","To avoid disruption during emergencies/pandemic, prepare a long-term funding mechanism to fund extra costs incurred to purchase medical supplies, hiring medical professionals and staff."]
["SR6","Consider social and cultural factors in the provision of health services, eliminate inequity, and address possible cross-cutting issues"]
{"$rows_left_out":57}